Information card for entry 7700850
Formula | C46 H50.5 N O3 P Ru S Se2 |
Calculated formula | C46 H50 N O3 P Ru S Se2 |
Title of publication | 4-Coordinated, 14-electron ruthenium(ii) chalcogenolate complexes: synthesis, electronic structure and reactions with PhICl<sub>2</sub> and organic azides. |
Authors of publication | Ng, Wai-Ming; Guo, Xueying; Cheung, Wai-Man; So, Yat-Ming; Chong, Man-Chun; Sung, Herman H.-Y.; Williams, Ian D.; Lin, Zhenyang; Leung, Wa-Hung |
Journal of publication | Dalton transactions (Cambridge, England : 2003) |
Year of publication | 2019 |
Journal volume | 48 |
Journal issue | 35 |
Pages of publication | 13315 - 13325 |
a | 9.9055 ± 0.0003 Å |
b | 14.8954 ± 0.0007 Å |
c | 15.8159 ± 0.0007 Å |
α | 70.854 ± 0.004° |
β | 82.761 ± 0.003° |
γ | 72.261 ± 0.003° |
Cell volume | 2098.8 ± 0.16 Å3 |
Cell temperature | 100.01 ± 0.1 K |
Ambient diffraction temperature | 100.01 ± 0.1 K |
Number of distinct elements | 8 |
Space group number | 2 |
Hermann-Mauguin space group symbol | P -1 |
Hall space group symbol | -P 1 |
Residual factor for all reflections | 0.0391 |
Residual factor for significantly intense reflections | 0.0367 |
Weighted residual factors for significantly intense reflections | 0.0947 |
Weighted residual factors for all reflections included in the refinement | 0.0967 |
Goodness-of-fit parameter for all reflections included in the refinement | 1 |
Diffraction radiation probe | x-ray |
Diffraction radiation wavelength | 1.54184 Å |
Diffraction radiation type | CuKα |