Information card for entry 7700851
Formula | C48 H62 Cl O P Ru S2 |
Calculated formula | C48 H62 Cl O P Ru S2 |
Title of publication | 4-Coordinated, 14-electron ruthenium(ii) chalcogenolate complexes: synthesis, electronic structure and reactions with PhICl<sub>2</sub> and organic azides. |
Authors of publication | Ng, Wai-Ming; Guo, Xueying; Cheung, Wai-Man; So, Yat-Ming; Chong, Man-Chun; Sung, Herman H.-Y.; Williams, Ian D.; Lin, Zhenyang; Leung, Wa-Hung |
Journal of publication | Dalton transactions (Cambridge, England : 2003) |
Year of publication | 2019 |
Journal volume | 48 |
Journal issue | 35 |
Pages of publication | 13315 - 13325 |
a | 9.6919 ± 0.0003 Å |
b | 14.1709 ± 0.0004 Å |
c | 17.7259 ± 0.0006 Å |
α | 78.473 ± 0.003° |
β | 82.579 ± 0.003° |
γ | 72.678 ± 0.003° |
Cell volume | 2270.91 ± 0.13 Å3 |
Cell temperature | 220 ± 0.1 K |
Ambient diffraction temperature | 220 ± 0.1 K |
Number of distinct elements | 7 |
Space group number | 2 |
Hermann-Mauguin space group symbol | P -1 |
Hall space group symbol | -P 1 |
Residual factor for all reflections | 0.0269 |
Residual factor for significantly intense reflections | 0.0252 |
Weighted residual factors for significantly intense reflections | 0.0625 |
Weighted residual factors for all reflections included in the refinement | 0.0637 |
Goodness-of-fit parameter for all reflections included in the refinement | 1.002 |
Diffraction radiation probe | x-ray |
Diffraction radiation wavelength | 1.54184 Å |
Diffraction radiation type | CuKα |