Information card for entry 7700859
Chemical name | 4 |
Formula | C26 H39 Dy N3 O18 P3 |
Calculated formula | C26 H39 Dy N3 O18 P3 |
Title of publication | Interplay of anthracene luminescence and dysprosium magnetism by steric control of photodimerization. |
Authors of publication | Huang, Xin-Da; Jia, Jia-Ge; Kurmoo, Mohamedally; Bao, Song-Song; Zheng, Li-Min |
Journal of publication | Dalton transactions (Cambridge, England : 2003) |
Year of publication | 2019 |
Journal volume | 48 |
Journal issue | 36 |
Pages of publication | 13769 - 13779 |
a | 24.425 ± 0.003 Å |
b | 8.8853 ± 0.0009 Å |
c | 18.2266 ± 0.0018 Å |
α | 90° |
β | 111.826 ± 0.001° |
γ | 90° |
Cell volume | 3672.1 ± 0.7 Å3 |
Cell temperature | 193 ± 2 K |
Ambient diffraction temperature | 193 ± 2 K |
Number of distinct elements | 6 |
Space group number | 14 |
Hermann-Mauguin space group symbol | P 1 21/c 1 |
Hall space group symbol | -P 2ybc |
Residual factor for all reflections | 0.059 |
Residual factor for significantly intense reflections | 0.0438 |
Weighted residual factors for significantly intense reflections | 0.0896 |
Weighted residual factors for all reflections included in the refinement | 0.0959 |
Goodness-of-fit parameter for all reflections included in the refinement | 0.991 |
Diffraction radiation wavelength | 0.71073 Å |
Diffraction radiation type | MoKα |