Information card for entry 7700860
Chemical name | 2 |
Formula | C28 H43 Dy N3 O18 P3 |
Calculated formula | C28 H43 Dy N3 O18 P3 |
Title of publication | Interplay of anthracene luminescence and dysprosium magnetism by steric control of photodimerization. |
Authors of publication | Huang, Xin-Da; Jia, Jia-Ge; Kurmoo, Mohamedally; Bao, Song-Song; Zheng, Li-Min |
Journal of publication | Dalton transactions (Cambridge, England : 2003) |
Year of publication | 2019 |
Journal volume | 48 |
Journal issue | 36 |
Pages of publication | 13769 - 13779 |
a | 18.444 ± 0.003 Å |
b | 11.7938 ± 0.0017 Å |
c | 37.298 ± 0.006 Å |
α | 90° |
β | 101.53 ± 0.002° |
γ | 90° |
Cell volume | 7950 ± 2 Å3 |
Cell temperature | 193 ± 2 K |
Ambient diffraction temperature | 193 ± 2 K |
Number of distinct elements | 6 |
Space group number | 15 |
Hermann-Mauguin space group symbol | C 1 2/c 1 |
Hall space group symbol | -C 2yc |
Residual factor for all reflections | 0.0623 |
Residual factor for significantly intense reflections | 0.0535 |
Weighted residual factors for significantly intense reflections | 0.1428 |
Weighted residual factors for all reflections included in the refinement | 0.1501 |
Goodness-of-fit parameter for all reflections included in the refinement | 1.067 |
Diffraction radiation wavelength | 0.71073 Å |
Diffraction radiation type | MoKα |