Information card for entry 7700862
Formula | Cs4 Nb6 O38 P2 Se2 |
Calculated formula | Cs4 Nb6 O38 P2 Se2 |
Title of publication | A novel peroxopolyoxoniobate incorporating mixed heteroatoms: [P<sub>2</sub>Se<sub>2</sub>Nb<sub>6</sub>(O<sub>2</sub>)<sub>6</sub>O<sub>22</sub>]<sup>8-</sup> . |
Authors of publication | Yang, Zongfei; Mu, Qiushui; Liang, Zhijie; Ma, Pengtao; Niu, Jingyang; Wang, Jingping |
Journal of publication | Dalton transactions (Cambridge, England : 2003) |
Year of publication | 2019 |
Journal volume | 48 |
Journal issue | 35 |
Pages of publication | 13135 - 13138 |
a | 10.118 ± 0.002 Å |
b | 10.424 ± 0.003 Å |
c | 11.089 ± 0.003 Å |
α | 94.043 ± 0.004° |
β | 103.437 ± 0.004° |
γ | 117.66 ± 0.004° |
Cell volume | 985.7 ± 0.4 Å3 |
Cell temperature | 296 ± 2 K |
Ambient diffraction temperature | 296.15 K |
Number of distinct elements | 5 |
Space group number | 2 |
Hermann-Mauguin space group symbol | P -1 |
Hall space group symbol | -P 1 |
Residual factor for all reflections | 0.0926 |
Residual factor for significantly intense reflections | 0.0731 |
Weighted residual factors for significantly intense reflections | 0.2004 |
Weighted residual factors for all reflections included in the refinement | 0.2177 |
Goodness-of-fit parameter for all reflections included in the refinement | 1.066 |
Diffraction radiation wavelength | 0.71073 Å |
Diffraction radiation type | MoKα |