Information card for entry 7700861
Chemical name | 3 |
Formula | C30 H47 Dy N3 O18 P3 |
Calculated formula | C30 H47 Dy N3 O18 P3 |
Title of publication | Interplay of anthracene luminescence and dysprosium magnetism by steric control of photodimerization. |
Authors of publication | Huang, Xin-Da; Jia, Jia-Ge; Kurmoo, Mohamedally; Bao, Song-Song; Zheng, Li-Min |
Journal of publication | Dalton transactions (Cambridge, England : 2003) |
Year of publication | 2019 |
Journal volume | 48 |
Journal issue | 36 |
Pages of publication | 13769 - 13779 |
a | 10.8696 ± 0.0008 Å |
b | 11.0111 ± 0.0008 Å |
c | 17.9728 ± 0.0014 Å |
α | 80.515 ± 0.001° |
β | 86.576 ± 0.001° |
γ | 89.819 ± 0.001° |
Cell volume | 2117.9 ± 0.3 Å3 |
Cell temperature | 193 ± 2 K |
Ambient diffraction temperature | 193 ± 2 K |
Number of distinct elements | 6 |
Space group number | 2 |
Hermann-Mauguin space group symbol | P -1 |
Hall space group symbol | -P 1 |
Residual factor for all reflections | 0.0327 |
Residual factor for significantly intense reflections | 0.0288 |
Weighted residual factors for significantly intense reflections | 0.0706 |
Weighted residual factors for all reflections included in the refinement | 0.0729 |
Goodness-of-fit parameter for all reflections included in the refinement | 1.038 |
Diffraction radiation wavelength | 0.71073 Å |
Diffraction radiation type | MoKα |