Information card for entry 7700874
Formula | C53 H111 Ce Cl2 Co3 N O29 P9 Ru |
Calculated formula | C53 H111 Ce Cl2 Co3 N O29 P9 Ru |
Title of publication | Reactions of cerium complexes with transition metal nitrides: synthesis and structure of heterometallic cerium complexes containing bridging catecholate ligands. |
Authors of publication | Cheung, Wai-Man; Au-Yeung, Ka-Chun; Wong, Kai-Hong; So, Yat-Ming; Sung, Herman H. Y.; Williams, Ian D.; Leung, Wa-Hung |
Journal of publication | Dalton transactions (Cambridge, England : 2003) |
Year of publication | 2019 |
Journal volume | 48 |
Journal issue | 35 |
Pages of publication | 13458 - 13465 |
a | 15.0838 ± 0.0005 Å |
b | 17.4193 ± 0.0007 Å |
c | 17.9226 ± 0.0007 Å |
α | 114.874 ± 0.004° |
β | 92.656 ± 0.003° |
γ | 103.883 ± 0.003° |
Cell volume | 4089.1 ± 0.3 Å3 |
Cell temperature | 100 ± 0.1 K |
Ambient diffraction temperature | 100 ± 0.1 K |
Number of distinct elements | 9 |
Space group number | 2 |
Hermann-Mauguin space group symbol | P -1 |
Hall space group symbol | -P 1 |
Residual factor for all reflections | 0.0535 |
Residual factor for significantly intense reflections | 0.0394 |
Weighted residual factors for significantly intense reflections | 0.0886 |
Weighted residual factors for all reflections included in the refinement | 0.0937 |
Goodness-of-fit parameter for all reflections included in the refinement | 1.021 |
Diffraction radiation probe | x-ray |
Diffraction radiation wavelength | 1.54184 Å |
Diffraction radiation type | CuKα |