Information card for entry 7700875
Formula | C46 H78 Ce Co2 N O22 P6 Ru |
Calculated formula | C46 H78 Ce Co2 N O22 P6 Ru |
Title of publication | Reactions of cerium complexes with transition metal nitrides: synthesis and structure of heterometallic cerium complexes containing bridging catecholate ligands. |
Authors of publication | Cheung, Wai-Man; Au-Yeung, Ka-Chun; Wong, Kai-Hong; So, Yat-Ming; Sung, Herman H. Y.; Williams, Ian D.; Leung, Wa-Hung |
Journal of publication | Dalton transactions (Cambridge, England : 2003) |
Year of publication | 2019 |
Journal volume | 48 |
Journal issue | 35 |
Pages of publication | 13458 - 13465 |
a | 22.936 ± 0.0003 Å |
b | 13.2047 ± 0.0002 Å |
c | 40.2851 ± 0.0007 Å |
α | 90° |
β | 93.4905 ± 0.0016° |
γ | 90° |
Cell volume | 12178.2 ± 0.3 Å3 |
Cell temperature | 100.01 ± 0.1 K |
Ambient diffraction temperature | 100.01 ± 0.1 K |
Number of distinct elements | 8 |
Space group number | 15 |
Hermann-Mauguin space group symbol | C 1 2/c 1 |
Hall space group symbol | -C 2yc |
Residual factor for all reflections | 0.0718 |
Residual factor for significantly intense reflections | 0.0582 |
Weighted residual factors for significantly intense reflections | 0.134 |
Weighted residual factors for all reflections included in the refinement | 0.1421 |
Goodness-of-fit parameter for all reflections included in the refinement | 1.017 |
Diffraction radiation probe | x-ray |
Diffraction radiation wavelength | 1.54184 Å |
Diffraction radiation type | CuKα |