Information card for entry 7700876
Formula | C46 H82 Ce Co2 O26 P6 Re |
Calculated formula | C46 H77 Ce Co2 O26 P6 Re |
Title of publication | Reactions of cerium complexes with transition metal nitrides: synthesis and structure of heterometallic cerium complexes containing bridging catecholate ligands. |
Authors of publication | Cheung, Wai-Man; Au-Yeung, Ka-Chun; Wong, Kai-Hong; So, Yat-Ming; Sung, Herman H. Y.; Williams, Ian D.; Leung, Wa-Hung |
Journal of publication | Dalton transactions (Cambridge, England : 2003) |
Year of publication | 2019 |
Journal volume | 48 |
Journal issue | 35 |
Pages of publication | 13458 - 13465 |
a | 11.86004 ± 0.00014 Å |
b | 22.5385 ± 0.0003 Å |
c | 24.0165 ± 0.0002 Å |
α | 90° |
β | 99.3323 ± 0.001° |
γ | 90° |
Cell volume | 6334.82 ± 0.13 Å3 |
Cell temperature | 100 ± 2 K |
Ambient diffraction temperature | 100.15 K |
Number of distinct elements | 7 |
Space group number | 14 |
Hermann-Mauguin space group symbol | P 1 21/c 1 |
Hall space group symbol | -P 2ybc |
Residual factor for all reflections | 0.045 |
Residual factor for significantly intense reflections | 0.0367 |
Weighted residual factors for significantly intense reflections | 0.0902 |
Weighted residual factors for all reflections included in the refinement | 0.0943 |
Goodness-of-fit parameter for all reflections included in the refinement | 1.036 |
Diffraction radiation probe | x-ray |
Diffraction radiation wavelength | 1.54184 Å |
Diffraction radiation type | CuKα |