Information card for entry 7700903
Formula | Ba2 Ga Li O14 P4 |
Calculated formula | Ba2 Ga Li O14 P4 |
Title of publication | A new diphosphate Ba<sub>2</sub>LiGa(P<sub>2</sub>O<sub>7</sub>)<sub>2</sub>: synthesis, crystal structure and Eu<sup>3+</sup>-activated fluorescence performance. |
Authors of publication | Li, Y. N.; Zhao, D.; Zhang, R. J.; Li, F. F.; Shi, L. Y.; Yao, Q. X.; Han, X. Y.; Cui, X. Q. |
Journal of publication | Dalton transactions (Cambridge, England : 2003) |
Year of publication | 2019 |
Journal volume | 48 |
Journal issue | 36 |
Pages of publication | 13780 - 13788 |
a | 7.6289 ± 0.0008 Å |
b | 8.5139 ± 0.0008 Å |
c | 9.1246 ± 0.0009 Å |
α | 73.463 ± 0.002° |
β | 82.196 ± 0.001° |
γ | 81.571 ± 0.002° |
Cell volume | 559.23 ± 0.1 Å3 |
Cell temperature | 296 ± 2 K |
Ambient diffraction temperature | 296 ± 2 K |
Number of distinct elements | 5 |
Space group number | 2 |
Hermann-Mauguin space group symbol | P -1 |
Hall space group symbol | -P 1 |
Residual factor for all reflections | 0.0445 |
Residual factor for significantly intense reflections | 0.0339 |
Weighted residual factors for significantly intense reflections | 0.0704 |
Weighted residual factors for all reflections included in the refinement | 0.0762 |
Goodness-of-fit parameter for all reflections included in the refinement | 1.013 |
Diffraction radiation wavelength | 0.71073 Å |
Diffraction radiation type | MoKα |