Information card for entry 7700904
Formula | C60 H57 Cd3 N7 O16 |
Calculated formula | C60 H57 Cd3 N7 O16 |
Title of publication | Post-imparting Brønsted acidity into an amino-functionalized MOF as a bifunctional luminescent turn-ON sensor for the detection of aluminum ions and lysine. |
Authors of publication | Liu, Yanhong; Huangfu, Mengjie; Wu, Pengyan; Jiang, Min; Zhao, Xiaoli; Liang, Lili; Xie, Liheng; Bai, Jianguo; Wang, Jian |
Journal of publication | Dalton transactions (Cambridge, England : 2003) |
Year of publication | 2019 |
Journal volume | 48 |
Journal issue | 36 |
Pages of publication | 13834 - 13840 |
a | 13.5289 ± 0.0006 Å |
b | 14.2783 ± 0.0007 Å |
c | 19.2066 ± 0.001 Å |
α | 73.046 ± 0.005° |
β | 73.172 ± 0.005° |
γ | 61.89 ± 0.003° |
Cell volume | 3079 ± 0.3 Å3 |
Cell temperature | 123 ± 2 K |
Ambient diffraction temperature | 123 ± 2 K |
Number of distinct elements | 5 |
Space group number | 2 |
Hermann-Mauguin space group symbol | P -1 |
Hall space group symbol | -P 1 |
Residual factor for all reflections | 0.0514 |
Residual factor for significantly intense reflections | 0.0492 |
Weighted residual factors for significantly intense reflections | 0.1398 |
Weighted residual factors for all reflections included in the refinement | 0.1416 |
Goodness-of-fit parameter for all reflections included in the refinement | 1.065 |
Diffraction radiation wavelength | 0.71073 Å |
Diffraction radiation type | MoKα |