Information card for entry 7700929
Formula | C34 H32 Cl2 N5 P Ru |
Calculated formula | C34 H32 Cl2 N5 P Ru |
Title of publication | Synthesis, characterization and catalytic activity of novel ruthenium complexes bearing NNN click based ligands. |
Authors of publication | Sole, Roberto; Bortoluzzi, Marco; Spannenberg, Anke; Tin, Sergey; Beghetto, Valentina; de Vries, Johannes G. |
Journal of publication | Dalton transactions (Cambridge, England : 2003) |
Year of publication | 2019 |
Journal volume | 48 |
Journal issue | 36 |
Pages of publication | 13580 - 13588 |
a | 9.876 ± 0.0003 Å |
b | 10.6624 ± 0.0004 Å |
c | 15.3841 ± 0.0005 Å |
α | 78.8256 ± 0.0014° |
β | 80.6086 ± 0.0013° |
γ | 81.4425 ± 0.0014° |
Cell volume | 1556.43 ± 0.09 Å3 |
Cell temperature | 150 ± 2 K |
Ambient diffraction temperature | 150 ± 2 K |
Number of distinct elements | 6 |
Space group number | 2 |
Hermann-Mauguin space group symbol | P -1 |
Hall space group symbol | -P 1 |
Residual factor for all reflections | 0.0262 |
Residual factor for significantly intense reflections | 0.0237 |
Weighted residual factors for significantly intense reflections | 0.0588 |
Weighted residual factors for all reflections included in the refinement | 0.0604 |
Goodness-of-fit parameter for all reflections included in the refinement | 1.042 |
Diffraction radiation wavelength | 1.54178 Å |
Diffraction radiation type | CuKα |