Information card for entry 7700930
Formula | C60 H48 Dy2 N2 O16 S6 |
Calculated formula | C60 H48 Dy2 N2 O16 S6 |
Title of publication | Exploration of SMM behavior of Ln<sub>2</sub> complexes derived from thianaphthene-2-carboxylic acid. |
Authors of publication | Biswas, Soumava; Mandal, Leena; Shen, Yongbing; Yamashita, Masahiro |
Journal of publication | Dalton transactions (Cambridge, England : 2003) |
Year of publication | 2019 |
Journal volume | 48 |
Journal issue | 37 |
Pages of publication | 14096 - 14102 |
a | 8.6584 ± 0.0017 Å |
b | 25.153 ± 0.005 Å |
c | 14.15 ± 0.003 Å |
α | 90° |
β | 106.892 ± 0.003° |
γ | 90° |
Cell volume | 2948.7 ± 1 Å3 |
Cell temperature | 120 ± 2 K |
Ambient diffraction temperature | 120 ± 2 K |
Number of distinct elements | 6 |
Space group number | 14 |
Hermann-Mauguin space group symbol | P 1 21/c 1 |
Hall space group symbol | -P 2ybc |
Residual factor for all reflections | 0.0762 |
Residual factor for significantly intense reflections | 0.0509 |
Weighted residual factors for significantly intense reflections | 0.1357 |
Weighted residual factors for all reflections included in the refinement | 0.1598 |
Goodness-of-fit parameter for all reflections included in the refinement | 1.037 |
Diffraction radiation wavelength | 0.71073 Å |
Diffraction radiation type | MoKα |