Information card for entry 7700934
Formula | C46 H60 Cl6 O3 S Zr |
Calculated formula | C46 H60 Cl6 O3 S Zr |
Title of publication | Titanium and zirconium complexes bearing new tridentate [OSO] bisphenolato-based ligands: synthesis, characterization and catalytic properties for alkene polymerization. |
Authors of publication | Song, Tingting; He, Jianghao; Liang, Liwei; Liu, Ning; Li, Feng; Tong, Xiaobo; Mu, Xiaoyue; Mu, Ying |
Journal of publication | Dalton transactions (Cambridge, England : 2003) |
Year of publication | 2019 |
Journal volume | 48 |
Journal issue | 36 |
Pages of publication | 13719 - 13731 |
a | 14.4804 ± 0.0004 Å |
b | 25.1371 ± 0.0007 Å |
c | 29.5376 ± 0.0007 Å |
α | 90° |
β | 90° |
γ | 90° |
Cell volume | 10751.5 ± 0.5 Å3 |
Cell temperature | 173 K |
Ambient diffraction temperature | 173 K |
Number of distinct elements | 6 |
Space group number | 72 |
Hermann-Mauguin space group symbol | I b a m |
Hall space group symbol | -I 2 2c |
Residual factor for all reflections | 0.1043 |
Residual factor for significantly intense reflections | 0.0822 |
Weighted residual factors for significantly intense reflections | 0.208 |
Weighted residual factors for all reflections included in the refinement | 0.2231 |
Goodness-of-fit parameter for all reflections included in the refinement | 1.081 |
Diffraction radiation wavelength | 0.71073 Å |
Diffraction radiation type | MoKα |