Information card for entry 7700935
Formula | C37 H62 Cl5 N O2 S Ti |
Calculated formula | C37 H62 Cl5 N O2 S Ti |
Title of publication | Titanium and zirconium complexes bearing new tridentate [OSO] bisphenolato-based ligands: synthesis, characterization and catalytic properties for alkene polymerization. |
Authors of publication | Song, Tingting; He, Jianghao; Liang, Liwei; Liu, Ning; Li, Feng; Tong, Xiaobo; Mu, Xiaoyue; Mu, Ying |
Journal of publication | Dalton transactions (Cambridge, England : 2003) |
Year of publication | 2019 |
Journal volume | 48 |
Journal issue | 36 |
Pages of publication | 13719 - 13731 |
a | 15.5858 ± 0.0011 Å |
b | 18.7525 ± 0.0011 Å |
c | 17.3122 ± 0.0012 Å |
α | 90° |
β | 107.126 ± 0.003° |
γ | 90° |
Cell volume | 4835.5 ± 0.6 Å3 |
Cell temperature | 173 K |
Ambient diffraction temperature | 173 K |
Number of distinct elements | 7 |
Space group number | 14 |
Hermann-Mauguin space group symbol | P 1 21/c 1 |
Hall space group symbol | -P 2ybc |
Residual factor for all reflections | 0.0763 |
Residual factor for significantly intense reflections | 0.0565 |
Weighted residual factors for significantly intense reflections | 0.1187 |
Weighted residual factors for all reflections included in the refinement | 0.135 |
Goodness-of-fit parameter for all reflections included in the refinement | 1.057 |
Diffraction radiation wavelength | 0.71073 Å |
Diffraction radiation type | MoKα |