Information card for entry 7700948
Formula | C45 H74 Cl2 N9 O18 Tb3 |
Calculated formula | C45 H73.9996 Cl1.9999 N9 O17.9998 Tb3 |
Title of publication | New examples of triangular terbium(iii) and holmium(iii) and hexagonal dysprosium(iii) single molecule toroics. |
Authors of publication | Langley, Stuart K.; Vignesh, Kuduva R.; Gupta, Tulika; Gartshore, Christopher J.; Rajaraman, Gopalan; Forsyth, Craig M.; Murray, Keith S. |
Journal of publication | Dalton transactions (Cambridge, England : 2003) |
Year of publication | 2019 |
Journal volume | 48 |
Journal issue | 41 |
Pages of publication | 15657 - 15667 |
a | 17.5762 ± 0.0006 Å |
b | 17.5762 ± 0.0006 Å |
c | 13.1892 ± 0.0007 Å |
α | 90° |
β | 90° |
γ | 120° |
Cell volume | 3528.6 ± 0.3 Å3 |
Cell temperature | 123 ± 2 K |
Ambient diffraction temperature | 123 ± 2 K |
Number of distinct elements | 6 |
Space group number | 147 |
Hermann-Mauguin space group symbol | P -3 |
Hall space group symbol | -P 3 |
Residual factor for all reflections | 0.0387 |
Residual factor for significantly intense reflections | 0.0351 |
Weighted residual factors for significantly intense reflections | 0.0881 |
Weighted residual factors for all reflections included in the refinement | 0.0916 |
Goodness-of-fit parameter for all reflections included in the refinement | 1.101 |
Diffraction radiation wavelength | 0.71073 Å |
Diffraction radiation type | MoKα |