Information card for entry 7700949
Formula | C45 H74 Cl2 Dy3 N9 O18 |
Calculated formula | C45 H73.9996 Cl1.9999 Dy3 N9 O17.9998 |
Title of publication | New examples of triangular terbium(iii) and holmium(iii) and hexagonal dysprosium(iii) single molecule toroics. |
Authors of publication | Langley, Stuart K.; Vignesh, Kuduva R.; Gupta, Tulika; Gartshore, Christopher J.; Rajaraman, Gopalan; Forsyth, Craig M.; Murray, Keith S. |
Journal of publication | Dalton transactions (Cambridge, England : 2003) |
Year of publication | 2019 |
Journal volume | 48 |
Journal issue | 41 |
Pages of publication | 15657 - 15667 |
a | 17.5986 ± 0.0003 Å |
b | 17.5986 ± 0.0003 Å |
c | 13.1888 ± 0.0005 Å |
α | 90° |
β | 90° |
γ | 120° |
Cell volume | 3537.47 ± 0.16 Å3 |
Cell temperature | 123 ± 2 K |
Ambient diffraction temperature | 123 ± 2 K |
Number of distinct elements | 6 |
Space group number | 147 |
Hermann-Mauguin space group symbol | P -3 |
Hall space group symbol | -P 3 |
Residual factor for all reflections | 0.0252 |
Residual factor for significantly intense reflections | 0.0233 |
Weighted residual factors for significantly intense reflections | 0.0683 |
Weighted residual factors for all reflections included in the refinement | 0.0693 |
Goodness-of-fit parameter for all reflections included in the refinement | 1.122 |
Diffraction radiation wavelength | 0.71073 Å |
Diffraction radiation type | MoKα |