Information card for entry 7700951
Formula | C27 H22 Gd N3 O8 |
Calculated formula | C27 H22 Gd N3 O8 |
Title of publication | Syntheses of three new isostructural lanthanide coordination polymers with tunable emission colours through bimetallic doping, and their luminescence sensing properties. |
Authors of publication | Liu, Ge; Lu, Yu-Ke; Ma, Yao-Yu; Wang, Xiao-Qing; Hou, Lei; Wang, Yao-Yu |
Journal of publication | Dalton transactions (Cambridge, England : 2003) |
Year of publication | 2019 |
Journal volume | 48 |
Journal issue | 36 |
Pages of publication | 13607 - 13613 |
a | 9.2005 ± 0.0002 Å |
b | 16.8932 ± 0.0004 Å |
c | 17.2386 ± 0.0005 Å |
α | 90° |
β | 94.641 ± 0.001° |
γ | 90° |
Cell volume | 2670.54 ± 0.12 Å3 |
Cell temperature | 296 ± 2 K |
Ambient diffraction temperature | 296 ± 2 K |
Number of distinct elements | 5 |
Space group number | 14 |
Hermann-Mauguin space group symbol | P 1 21/c 1 |
Hall space group symbol | -P 2ybc |
Residual factor for all reflections | 0.0273 |
Residual factor for significantly intense reflections | 0.0224 |
Weighted residual factors for significantly intense reflections | 0.0469 |
Weighted residual factors for all reflections included in the refinement | 0.0493 |
Goodness-of-fit parameter for all reflections included in the refinement | 1.084 |
Diffraction radiation wavelength | 0.71073 Å |
Diffraction radiation type | MoKα |