Information card for entry 7700950
Formula | C27 H22 Eu N3 O8 |
Calculated formula | C27 H22 Eu N3 O8 |
Title of publication | Syntheses of three new isostructural lanthanide coordination polymers with tunable emission colours through bimetallic doping, and their luminescence sensing properties. |
Authors of publication | Liu, Ge; Lu, Yu-Ke; Ma, Yao-Yu; Wang, Xiao-Qing; Hou, Lei; Wang, Yao-Yu |
Journal of publication | Dalton transactions (Cambridge, England : 2003) |
Year of publication | 2019 |
Journal volume | 48 |
Journal issue | 36 |
Pages of publication | 13607 - 13613 |
a | 9.2177 ± 0.0002 Å |
b | 16.4957 ± 0.0003 Å |
c | 17.2738 ± 0.0004 Å |
α | 90° |
β | 94.269 ± 0.001° |
γ | 90° |
Cell volume | 2619.24 ± 0.1 Å3 |
Cell temperature | 150 ± 2 K |
Ambient diffraction temperature | 150 ± 2 K |
Number of distinct elements | 5 |
Space group number | 14 |
Hermann-Mauguin space group symbol | P 1 21/c 1 |
Hall space group symbol | -P 2ybc |
Residual factor for all reflections | 0.015 |
Residual factor for significantly intense reflections | 0.0144 |
Weighted residual factors for significantly intense reflections | 0.0346 |
Weighted residual factors for all reflections included in the refinement | 0.0349 |
Goodness-of-fit parameter for all reflections included in the refinement | 1.053 |
Diffraction radiation wavelength | 0.71073 Å |
Diffraction radiation type | MoKα |