Information card for entry 7700958
Formula | C30 H22 Cl2 Cu2 N8 O4 |
Calculated formula | C30 H22 Cl2 Cu2 N8 O4 |
Title of publication | A dual-emitting Tb(iii)&Yb(iii)-functionalized coordination polymer: a "turn-on" sensor for N-methylformamide in urine and a "turn-off" sensor for methylglyoxal in serum. |
Authors of publication | Zheng, Xubin; Fan, Ruiqing; Lu, Haoyang; Wang, Bowen; Wu, Jingkun; Wang, Ping; Yang, Yulin |
Journal of publication | Dalton transactions (Cambridge, England : 2003) |
Year of publication | 2019 |
Journal volume | 48 |
Journal issue | 38 |
Pages of publication | 14408 - 14417 |
a | 7.2134 ± 0.0006 Å |
b | 12.8966 ± 0.0011 Å |
c | 15.8428 ± 0.0013 Å |
α | 90° |
β | 95.387 ± 0.001° |
γ | 90° |
Cell volume | 1467.3 ± 0.2 Å3 |
Cell temperature | 296 ± 2 K |
Ambient diffraction temperature | 296 ± 2 K |
Number of distinct elements | 6 |
Space group number | 14 |
Hermann-Mauguin space group symbol | P 1 21/c 1 |
Hall space group symbol | -P 2ybc |
Residual factor for all reflections | 0.0434 |
Residual factor for significantly intense reflections | 0.0322 |
Weighted residual factors for significantly intense reflections | 0.0812 |
Weighted residual factors for all reflections included in the refinement | 0.0865 |
Goodness-of-fit parameter for all reflections included in the refinement | 1.038 |
Diffraction radiation wavelength | 0.71073 Å |
Diffraction radiation type | MoKα |