Information card for entry 7700959
Formula | C30 H24 Cl4 Cu2 N8 O4 |
Calculated formula | C30 H24 Cl4 Cu2 N8 O4 |
Title of publication | A dual-emitting Tb(iii)&Yb(iii)-functionalized coordination polymer: a "turn-on" sensor for N-methylformamide in urine and a "turn-off" sensor for methylglyoxal in serum. |
Authors of publication | Zheng, Xubin; Fan, Ruiqing; Lu, Haoyang; Wang, Bowen; Wu, Jingkun; Wang, Ping; Yang, Yulin |
Journal of publication | Dalton transactions (Cambridge, England : 2003) |
Year of publication | 2019 |
Journal volume | 48 |
Journal issue | 38 |
Pages of publication | 14408 - 14417 |
a | 7.3048 ± 0.0009 Å |
b | 8.8619 ± 0.0011 Å |
c | 24.838 ± 0.003 Å |
α | 92.591 ± 0.002° |
β | 97.865 ± 0.002° |
γ | 96.668 ± 0.002° |
Cell volume | 1578.9 ± 0.3 Å3 |
Cell temperature | 296 ± 2 K |
Ambient diffraction temperature | 296 ± 2 K |
Number of distinct elements | 6 |
Space group number | 2 |
Hermann-Mauguin space group symbol | P -1 |
Hall space group symbol | -P 1 |
Residual factor for all reflections | 0.058 |
Residual factor for significantly intense reflections | 0.0373 |
Weighted residual factors for significantly intense reflections | 0.0913 |
Weighted residual factors for all reflections included in the refinement | 0.1113 |
Goodness-of-fit parameter for all reflections included in the refinement | 1.056 |
Diffraction radiation wavelength | 0.71073 Å |
Diffraction radiation type | MoKα |