Information card for entry 7700971
Chemical name | Dy-Cu |
Formula | C49 H35 Cu Dy F30 N6 O14 |
Calculated formula | C49 H35 Cu Dy F30 N6 O14 |
Title of publication | Heterometallic Ln-Cu complexes derived from a phenyl pyrimidyl substituted nitronyl nitroxide biradical. |
Authors of publication | Wang, Kang; Sun, Juan; Xi, Lu; Lu, Jiao; Jing, Pei; Li, Licun |
Journal of publication | Dalton transactions (Cambridge, England : 2003) |
Year of publication | 2019 |
Journal volume | 48 |
Journal issue | 38 |
Pages of publication | 14383 - 14389 |
a | 12.7276 ± 0.0009 Å |
b | 16.6594 ± 0.0011 Å |
c | 18.6223 ± 0.0019 Å |
α | 65.678 ± 0.009° |
β | 74.451 ± 0.007° |
γ | 68.87 ± 0.006° |
Cell volume | 3322.8 ± 0.5 Å3 |
Cell temperature | 113 K |
Ambient diffraction temperature | 113 K |
Number of distinct elements | 7 |
Space group number | 2 |
Hermann-Mauguin space group symbol | P -1 |
Hall space group symbol | -P 1 |
Residual factor for all reflections | 0.1623 |
Residual factor for significantly intense reflections | 0.1032 |
Weighted residual factors for significantly intense reflections | 0.2457 |
Weighted residual factors for all reflections included in the refinement | 0.3063 |
Goodness-of-fit parameter for all reflections included in the refinement | 1.016 |
Diffraction radiation wavelength | 0.71073 Å |
Diffraction radiation type | MoKα |