Information card for entry 7700972
Chemical name | Tb-Cu |
Formula | C49 H35 Cu F30 N6 O14 Tb |
Calculated formula | C49 H35 Cu F30 N6 O14 Tb |
Title of publication | Heterometallic Ln-Cu complexes derived from a phenyl pyrimidyl substituted nitronyl nitroxide biradical. |
Authors of publication | Wang, Kang; Sun, Juan; Xi, Lu; Lu, Jiao; Jing, Pei; Li, Licun |
Journal of publication | Dalton transactions (Cambridge, England : 2003) |
Year of publication | 2019 |
Journal volume | 48 |
Journal issue | 38 |
Pages of publication | 14383 - 14389 |
a | 12.7313 ± 0.0014 Å |
b | 16.474 ± 0.002 Å |
c | 18.826 ± 0.003 Å |
α | 66.608 ± 0.014° |
β | 74.109 ± 0.012° |
γ | 69.007 ± 0.011° |
Cell volume | 3343.3 ± 0.9 Å3 |
Cell temperature | 113 K |
Ambient diffraction temperature | 113 K |
Number of distinct elements | 7 |
Space group number | 2 |
Hermann-Mauguin space group symbol | P -1 |
Hall space group symbol | -P 1 |
Residual factor for all reflections | 0.1282 |
Residual factor for significantly intense reflections | 0.0759 |
Weighted residual factors for significantly intense reflections | 0.1858 |
Weighted residual factors for all reflections included in the refinement | 0.2259 |
Goodness-of-fit parameter for all reflections included in the refinement | 1.021 |
Diffraction radiation probe | x-ray |
Diffraction radiation wavelength | 0.71073 Å |
Diffraction radiation type | MoKα |