Information card for entry 7700982
Formula | C12 H28 B2 Co F8 N5 O |
Calculated formula | C12 H28 B2 Co F8 N5 O |
Title of publication | Finding a new pathway for acid-induced nitrite reduction reaction: formation of nitric oxide with hydrogen peroxide. |
Authors of publication | Puthiyaveetil Yoosaf, Mohammed Ajmal; Ghosh, Somnath; Narayan, Yatheesh; Yadav, Munendra; Sahoo, Subash Chandra; Kumar, Pankaj |
Journal of publication | Dalton transactions (Cambridge, England : 2003) |
Year of publication | 2019 |
Journal volume | 48 |
Journal issue | 37 |
Pages of publication | 13916 - 13920 |
a | 12.8109 ± 0.0004 Å |
b | 18.5996 ± 0.0006 Å |
c | 8.9913 ± 0.0003 Å |
α | 90° |
β | 90° |
γ | 90° |
Cell volume | 2142.43 ± 0.12 Å3 |
Cell temperature | 293 ± 2 K |
Ambient diffraction temperature | 293 ± 2 K |
Number of distinct elements | 7 |
Space group number | 33 |
Hermann-Mauguin space group symbol | P n a 21 |
Hall space group symbol | P 2c -2n |
Residual factor for all reflections | 0.0707 |
Residual factor for significantly intense reflections | 0.0487 |
Weighted residual factors for significantly intense reflections | 0.126 |
Weighted residual factors for all reflections included in the refinement | 0.1429 |
Goodness-of-fit parameter for all reflections included in the refinement | 1.049 |
Diffraction radiation wavelength | 0.71073 Å |
Diffraction radiation type | MoKα |