Information card for entry 7700983
Formula | C14 H31 B2 Co F8 N5 |
Calculated formula | C14 H31 B2 Co F8 N5 |
Title of publication | Finding a new pathway for acid-induced nitrite reduction reaction: formation of nitric oxide with hydrogen peroxide. |
Authors of publication | Puthiyaveetil Yoosaf, Mohammed Ajmal; Ghosh, Somnath; Narayan, Yatheesh; Yadav, Munendra; Sahoo, Subash Chandra; Kumar, Pankaj |
Journal of publication | Dalton transactions (Cambridge, England : 2003) |
Year of publication | 2019 |
Journal volume | 48 |
Journal issue | 37 |
Pages of publication | 13916 - 13920 |
a | 14.388 ± 0.0003 Å |
b | 8.818 ± 0.0001 Å |
c | 16.9008 ± 0.0003 Å |
α | 90° |
β | 90° |
γ | 90° |
Cell volume | 2144.26 ± 0.06 Å3 |
Cell temperature | 292 ± 3 K |
Ambient diffraction temperature | 292 ± 2 K |
Number of distinct elements | 6 |
Space group number | 62 |
Hermann-Mauguin space group symbol | P n m a |
Hall space group symbol | -P 2ac 2n |
Residual factor for all reflections | 0.0344 |
Residual factor for significantly intense reflections | 0.0322 |
Weighted residual factors for significantly intense reflections | 0.082 |
Weighted residual factors for all reflections included in the refinement | 0.0833 |
Goodness-of-fit parameter for all reflections included in the refinement | 1.047 |
Diffraction radiation probe | x-ray |
Diffraction radiation wavelength | 0.71073 Å |
Diffraction radiation type | MoKα |