Information card for entry 7700985
Formula | C12 H28 B2 Co F8 N5 O |
Calculated formula | C12 H28 B2 Co F8 N5 O |
Title of publication | Finding a new pathway for acid-induced nitrite reduction reaction: formation of nitric oxide with hydrogen peroxide. |
Authors of publication | Puthiyaveetil Yoosaf, Mohammed Ajmal; Ghosh, Somnath; Narayan, Yatheesh; Yadav, Munendra; Sahoo, Subash Chandra; Kumar, Pankaj |
Journal of publication | Dalton transactions (Cambridge, England : 2003) |
Year of publication | 2019 |
Journal volume | 48 |
Journal issue | 37 |
Pages of publication | 13916 - 13920 |
a | 8.91858 ± 0.00015 Å |
b | 12.5051 ± 0.0002 Å |
c | 18.4063 ± 0.0003 Å |
α | 90° |
β | 89.9861 ± 0.0014° |
γ | 90° |
Cell volume | 2052.81 ± 0.06 Å3 |
Cell temperature | 123 ± 4 K |
Ambient diffraction temperature | 123 ± 2 K |
Number of distinct elements | 7 |
Space group number | 14 |
Hermann-Mauguin space group symbol | P 1 21/n 1 |
Hall space group symbol | -P 2yn |
Residual factor for all reflections | 0.0431 |
Residual factor for significantly intense reflections | 0.037 |
Weighted residual factors for significantly intense reflections | 0.0877 |
Weighted residual factors for all reflections included in the refinement | 0.0911 |
Goodness-of-fit parameter for all reflections included in the refinement | 1.042 |
Diffraction radiation wavelength | 0.71073 Å |
Diffraction radiation type | MoKα |