Information card for entry 7700984
Formula | C12 H28 B Co F4 N5 O2 |
Calculated formula | C12 H28 B Co F4 N5 O2 |
Title of publication | Finding a new pathway for acid-induced nitrite reduction reaction: formation of nitric oxide with hydrogen peroxide. |
Authors of publication | Puthiyaveetil Yoosaf, Mohammed Ajmal; Ghosh, Somnath; Narayan, Yatheesh; Yadav, Munendra; Sahoo, Subash Chandra; Kumar, Pankaj |
Journal of publication | Dalton transactions (Cambridge, England : 2003) |
Year of publication | 2019 |
Journal volume | 48 |
Journal issue | 37 |
Pages of publication | 13916 - 13920 |
a | 13.0277 ± 0.0002 Å |
b | 14.5867 ± 0.0002 Å |
c | 19.2369 ± 0.0003 Å |
α | 90° |
β | 90° |
γ | 90° |
Cell volume | 3655.61 ± 0.09 Å3 |
Cell temperature | 129.99 ± 0.12 K |
Ambient diffraction temperature | 129.99 ± 0.12 K |
Number of distinct elements | 7 |
Space group number | 61 |
Hermann-Mauguin space group symbol | P b c a |
Hall space group symbol | -P 2ac 2ab |
Residual factor for all reflections | 0.0397 |
Residual factor for significantly intense reflections | 0.0348 |
Weighted residual factors for significantly intense reflections | 0.0882 |
Weighted residual factors for all reflections included in the refinement | 0.0911 |
Goodness-of-fit parameter for all reflections included in the refinement | 1.071 |
Diffraction radiation probe | x-ray |
Diffraction radiation wavelength | 0.71073 Å |
Diffraction radiation type | MoKα |