Information card for entry 7701001
Formula | C17 H13 Cl3 N2 O Pt |
Calculated formula | C17 H13 Cl3 N2 O Pt |
Title of publication | A family of readily synthesised phosphorescent platinum(ii) complexes based on tridentate N^N^O-coordinating Schiff-base ligands. |
Authors of publication | Puttock, Emma V.; Fradgley, Jack D.; Yufit, Dmitry S.; Williams, J. A. Gareth |
Journal of publication | Dalton transactions (Cambridge, England : 2003) |
Year of publication | 2019 |
Journal volume | 48 |
Journal issue | 40 |
Pages of publication | 15012 - 15028 |
a | 7.8778 ± 0.0006 Å |
b | 8.8726 ± 0.0008 Å |
c | 13.2483 ± 0.001 Å |
α | 75.787 ± 0.007° |
β | 72.823 ± 0.007° |
γ | 74.302 ± 0.008° |
Cell volume | 837.79 ± 0.13 Å3 |
Cell temperature | 120 ± 2 K |
Ambient diffraction temperature | 120 K |
Number of distinct elements | 6 |
Space group number | 2 |
Hermann-Mauguin space group symbol | P -1 |
Hall space group symbol | -P 1 |
Residual factor for all reflections | 0.0535 |
Residual factor for significantly intense reflections | 0.0388 |
Weighted residual factors for significantly intense reflections | 0.0645 |
Weighted residual factors for all reflections included in the refinement | 0.0693 |
Goodness-of-fit parameter for all reflections included in the refinement | 0.99 |
Diffraction radiation probe | x-ray |
Diffraction radiation wavelength | 0.71073 Å |
Diffraction radiation type | MoKα |