Information card for entry 7701000
Formula | C56 H254 Mo18 N14 Na2 O222 P6 W36 |
Calculated formula | C56 H138 Mo17.82 N14 Na2 O203.8 P6 W36.18 |
Title of publication | A "directed precursor self-assembly" strategy for the facile synthesis of heteropoly blues: crystal structures, formation mechanism and electron distribution. |
Authors of publication | Wang, Yuchao; Li, Fengyan; Jiang, Ning; Liu, Xizheng; Xu, Lin |
Journal of publication | Dalton transactions (Cambridge, England : 2003) |
Year of publication | 2019 |
Journal volume | 48 |
Journal issue | 38 |
Pages of publication | 14347 - 14353 |
a | 66.961 Å |
b | 18.432 Å |
c | 23.971 Å |
α | 90° |
β | 110.62° |
γ | 90° |
Cell volume | 27690.3 Å3 |
Cell temperature | 293 ± 2 K |
Ambient diffraction temperature | 293 ± 2 K |
Number of distinct elements | 8 |
Space group number | 15 |
Hermann-Mauguin space group symbol | C 1 2/c 1 |
Hall space group symbol | -C 2yc |
Residual factor for all reflections | 0.092 |
Residual factor for significantly intense reflections | 0.0642 |
Weighted residual factors for significantly intense reflections | 0.157 |
Weighted residual factors for all reflections included in the refinement | 0.1727 |
Goodness-of-fit parameter for all reflections included in the refinement | 1.049 |
Diffraction radiation wavelength | 0.71073 Å |
Diffraction radiation type | MoKα |