Information card for entry 7701003
Formula | C30 H26 F6 N2 O3 Pt S2 |
Calculated formula | C30 H26 F6 N2 O3 Pt S2 |
Title of publication | A family of readily synthesised phosphorescent platinum(ii) complexes based on tridentate N^N^O-coordinating Schiff-base ligands. |
Authors of publication | Puttock, Emma V.; Fradgley, Jack D.; Yufit, Dmitry S.; Williams, J. A. Gareth |
Journal of publication | Dalton transactions (Cambridge, England : 2003) |
Year of publication | 2019 |
Journal volume | 48 |
Journal issue | 40 |
Pages of publication | 15012 - 15028 |
a | 16.5452 ± 0.0007 Å |
b | 18.5441 ± 0.0007 Å |
c | 9.7467 ± 0.0004 Å |
α | 90° |
β | 91.0751 ± 0.0014° |
γ | 90° |
Cell volume | 2989.9 ± 0.2 Å3 |
Cell temperature | 120 K |
Ambient diffraction temperature | 120 K |
Number of distinct elements | 7 |
Space group number | 14 |
Hermann-Mauguin space group symbol | P 1 21/c 1 |
Hall space group symbol | -P 2ybc |
Residual factor for all reflections | 0.0389 |
Residual factor for significantly intense reflections | 0.0243 |
Weighted residual factors for significantly intense reflections | 0.0399 |
Weighted residual factors for all reflections included in the refinement | 0.0429 |
Goodness-of-fit parameter for all reflections included in the refinement | 1.039 |
Diffraction radiation probe | x-ray |
Diffraction radiation wavelength | 0.71073 Å |
Diffraction radiation type | MoKα |