Information card for entry 7701004
Formula | C14 H15 Cl N4 O4 Pt S |
Calculated formula | C14 H15 Cl N4 O4 Pt S |
Title of publication | A family of readily synthesised phosphorescent platinum(ii) complexes based on tridentate N^N^O-coordinating Schiff-base ligands. |
Authors of publication | Puttock, Emma V.; Fradgley, Jack D.; Yufit, Dmitry S.; Williams, J. A. Gareth |
Journal of publication | Dalton transactions (Cambridge, England : 2003) |
Year of publication | 2019 |
Journal volume | 48 |
Journal issue | 40 |
Pages of publication | 15012 - 15028 |
a | 7.0662 ± 0.0002 Å |
b | 23.0266 ± 0.0005 Å |
c | 11.1435 ± 0.0003 Å |
α | 90° |
β | 106.773 ± 0.002° |
γ | 90° |
Cell volume | 1736.03 ± 0.08 Å3 |
Cell temperature | 120 K |
Ambient diffraction temperature | 120 K |
Number of distinct elements | 7 |
Space group number | 14 |
Hermann-Mauguin space group symbol | P 1 21/n 1 |
Hall space group symbol | -P 2yn |
Residual factor for all reflections | 0.0539 |
Residual factor for significantly intense reflections | 0.0408 |
Weighted residual factors for significantly intense reflections | 0.0718 |
Weighted residual factors for all reflections included in the refinement | 0.0749 |
Goodness-of-fit parameter for all reflections included in the refinement | 1.204 |
Diffraction radiation probe | x-ray |
Diffraction radiation wavelength | 0.71073 Å |
Diffraction radiation type | MoKα |