Information card for entry 7701007
Formula | C14 H14 Cl N3 O2 Pt |
Calculated formula | C14 H14 Cl N3 O2 Pt |
Title of publication | A family of readily synthesised phosphorescent platinum(ii) complexes based on tridentate N^N^O-coordinating Schiff-base ligands. |
Authors of publication | Puttock, Emma V.; Fradgley, Jack D.; Yufit, Dmitry S.; Williams, J. A. Gareth |
Journal of publication | Dalton transactions (Cambridge, England : 2003) |
Year of publication | 2019 |
Journal volume | 48 |
Journal issue | 40 |
Pages of publication | 15012 - 15028 |
a | 8.3913 ± 0.0005 Å |
b | 8.2576 ± 0.0005 Å |
c | 19.9601 ± 0.0011 Å |
α | 90° |
β | 92.4713 ± 0.0019° |
γ | 90° |
Cell volume | 1381.79 ± 0.14 Å3 |
Cell temperature | 120 K |
Ambient diffraction temperature | 120 K |
Number of distinct elements | 6 |
Space group number | 14 |
Hermann-Mauguin space group symbol | P 1 21/n 1 |
Hall space group symbol | -P 2yn |
Residual factor for all reflections | 0.0465 |
Residual factor for significantly intense reflections | 0.0268 |
Weighted residual factors for significantly intense reflections | 0.0427 |
Weighted residual factors for all reflections included in the refinement | 0.0461 |
Goodness-of-fit parameter for all reflections included in the refinement | 1.041 |
Diffraction radiation probe | x-ray |
Diffraction radiation wavelength | 0.71073 Å |
Diffraction radiation type | MoKα |