Information card for entry 7701006
Formula | C13 H14 Cl N3 O3 Pt |
Calculated formula | C13 H14 Cl N3 O3 Pt |
Title of publication | A family of readily synthesised phosphorescent platinum(ii) complexes based on tridentate N^N^O-coordinating Schiff-base ligands. |
Authors of publication | Puttock, Emma V.; Fradgley, Jack D.; Yufit, Dmitry S.; Williams, J. A. Gareth |
Journal of publication | Dalton transactions (Cambridge, England : 2003) |
Year of publication | 2019 |
Journal volume | 48 |
Journal issue | 40 |
Pages of publication | 15012 - 15028 |
a | 8.5021 ± 0.0007 Å |
b | 8.6034 ± 0.0007 Å |
c | 10.4411 ± 0.0008 Å |
α | 66.85 ± 0.002° |
β | 88.962 ± 0.003° |
γ | 86.218 ± 0.003° |
Cell volume | 700.68 ± 0.1 Å3 |
Cell temperature | 120 K |
Ambient diffraction temperature | 120 K |
Number of distinct elements | 6 |
Space group number | 2 |
Hermann-Mauguin space group symbol | P -1 |
Hall space group symbol | -P 1 |
Residual factor for all reflections | 0.0222 |
Residual factor for significantly intense reflections | 0.0187 |
Weighted residual factors for significantly intense reflections | 0.0401 |
Weighted residual factors for all reflections included in the refinement | 0.041 |
Goodness-of-fit parameter for all reflections included in the refinement | 1.059 |
Diffraction radiation probe | x-ray |
Diffraction radiation wavelength | 0.71073 Å |
Diffraction radiation type | MoKα |