Information card for entry 7701023
Common name | Compound X |
Formula | C42 H41 F6 N6 P3 Ru S |
Calculated formula | C42 H41 F6 N6 P3 Ru S |
Title of publication | Non-mutagenic Ru(ii) complexes: cytotoxicity, topoisomerase IB inhibition, DNA and HSA binding. |
Authors of publication | da Silva, Monize M.; de Camargo, Mariana S.; Correa, Rodrigo S.; Castelli, Silvia; De Grandis, Rone A.; Takarada, Jessica E.; Varanda, Eliana A.; Castellano, Eduardo E.; Deflon, Victor M.; Cominetti, Marcia R.; Desideri, Alessandro; Batista, Alzir A. |
Journal of publication | Dalton transactions (Cambridge, England : 2003) |
Year of publication | 2019 |
Journal volume | 48 |
Journal issue | 39 |
Pages of publication | 14885 - 14897 |
a | 18.3678 ± 0.0008 Å |
b | 20.3902 ± 0.0005 Å |
c | 22.2064 ± 0.0009 Å |
α | 90° |
β | 90° |
γ | 90° |
Cell volume | 8316.8 ± 0.5 Å3 |
Cell temperature | 296 ± 2 K |
Ambient diffraction temperature | 296 ± 2 K |
Number of distinct elements | 7 |
Space group number | 61 |
Hermann-Mauguin space group symbol | P b c a |
Hall space group symbol | -P 2ac 2ab |
Residual factor for all reflections | 0.0997 |
Residual factor for significantly intense reflections | 0.0542 |
Weighted residual factors for significantly intense reflections | 0.1222 |
Weighted residual factors for all reflections included in the refinement | 0.1436 |
Goodness-of-fit parameter for all reflections included in the refinement | 1.015 |
Diffraction radiation probe | x-ray |
Diffraction radiation wavelength | 0.71073 Å |
Diffraction radiation type | MoKα |