Information card for entry 7701024
Formula | C46 H45 F6 N4 O3 P3 Ru S |
Calculated formula | C46 H45 F6 N4 O3 P3 Ru S |
Title of publication | Non-mutagenic Ru(ii) complexes: cytotoxicity, topoisomerase IB inhibition, DNA and HSA binding. |
Authors of publication | da Silva, Monize M.; de Camargo, Mariana S.; Correa, Rodrigo S.; Castelli, Silvia; De Grandis, Rone A.; Takarada, Jessica E.; Varanda, Eliana A.; Castellano, Eduardo E.; Deflon, Victor M.; Cominetti, Marcia R.; Desideri, Alessandro; Batista, Alzir A. |
Journal of publication | Dalton transactions (Cambridge, England : 2003) |
Year of publication | 2019 |
Journal volume | 48 |
Journal issue | 39 |
Pages of publication | 14885 - 14897 |
a | 10.0164 ± 0.0004 Å |
b | 31.8519 ± 0.0014 Å |
c | 14.9197 ± 0.0007 Å |
α | 90° |
β | 100.055 ± 0.002° |
γ | 90° |
Cell volume | 4686.9 ± 0.4 Å3 |
Cell temperature | 296 ± 2 K |
Ambient diffraction temperature | 296 ± 2 K |
Number of distinct elements | 8 |
Space group number | 14 |
Hermann-Mauguin space group symbol | P 1 21/c 1 |
Hall space group symbol | -P 2ybc |
Residual factor for all reflections | 0.12 |
Residual factor for significantly intense reflections | 0.0604 |
Weighted residual factors for significantly intense reflections | 0.1657 |
Weighted residual factors for all reflections included in the refinement | 0.187 |
Goodness-of-fit parameter for all reflections included in the refinement | 0.931 |
Diffraction radiation wavelength | 0.71073 Å |
Diffraction radiation type | MoKα |