Information card for entry 7701025
Formula | C22 H36 Mn N2 O4 P |
Calculated formula | C22 H36 Mn N2 O4 P |
Title of publication | CO<sub>2</sub> activation by manganese pincer complexes through different modes of metal-ligand cooperation. |
Authors of publication | Kumar, Amit; Daw, Prosenjit; Espinosa-Jalapa, Noel Angel; Leitus, Gregory; Shimon, Linda J. W.; Ben-David, Yehoshoa; Milstein, David |
Journal of publication | Dalton transactions (Cambridge, England : 2003) |
Year of publication | 2019 |
Journal volume | 48 |
Journal issue | 39 |
Pages of publication | 14580 - 14584 |
a | 12.713 ± 0.003 Å |
b | 14.096 ± 0.003 Å |
c | 13.603 ± 0.003 Å |
α | 90° |
β | 102.34 ± 0.03° |
γ | 90° |
Cell volume | 2381.4 ± 1 Å3 |
Cell temperature | 100 ± 2 K |
Ambient diffraction temperature | 100 ± 2 K |
Number of distinct elements | 6 |
Space group number | 14 |
Hermann-Mauguin space group symbol | P 1 21/n 1 |
Hall space group symbol | -P 2yn |
Residual factor for all reflections | 0.0415 |
Residual factor for significantly intense reflections | 0.0294 |
Weighted residual factors for significantly intense reflections | 0.0681 |
Weighted residual factors for all reflections included in the refinement | 0.0725 |
Goodness-of-fit parameter for all reflections included in the refinement | 1.025 |
Diffraction radiation wavelength | 0.71073 Å |
Diffraction radiation type | MoKα |