Information card for entry 7701032
Formula | C50 H60 Cl Ir O2 P2 Si2 |
Calculated formula | C50 H60 Cl Ir O2 P2 Si2 |
Title of publication | Iridium complexes featuring a tridentate SiPSi ligand: from dimeric to monomeric 14, 16 or 18-electron species. |
Authors of publication | Cuevas-Chávez, Cynthia A; Vendier, Laure; Sabo-Etienne, Sylviane; Montiel-Palma, Virginia |
Journal of publication | Dalton transactions (Cambridge, England : 2003) |
Year of publication | 2019 |
Journal volume | 48 |
Journal issue | 37 |
Pages of publication | 14010 - 14018 |
a | 10.2493 ± 0.0014 Å |
b | 22.784 ± 0.003 Å |
c | 19.998 ± 0.003 Å |
α | 90° |
β | 102.638 ± 0.003° |
γ | 90° |
Cell volume | 4556.8 ± 1.1 Å3 |
Cell temperature | 100 ± 2 K |
Ambient diffraction temperature | 100 ± 2 K |
Number of distinct elements | 7 |
Space group number | 14 |
Hermann-Mauguin space group symbol | P 1 21/c 1 |
Hall space group symbol | -P 2ybc |
Residual factor for all reflections | 0.0223 |
Residual factor for significantly intense reflections | 0.0208 |
Weighted residual factors for significantly intense reflections | 0.0454 |
Weighted residual factors for all reflections included in the refinement | 0.0458 |
Goodness-of-fit parameter for all reflections included in the refinement | 1.175 |
Diffraction radiation wavelength | 0.71073 Å |
Diffraction radiation type | MoKα |