Information card for entry 7701033
Formula | C44 H66 Cl5 Ir P2 Si2 |
Calculated formula | C44 H66 Cl5 Ir P2 Si2 |
Title of publication | Iridium complexes featuring a tridentate SiPSi ligand: from dimeric to monomeric 14, 16 or 18-electron species. |
Authors of publication | Cuevas-Chávez, Cynthia A; Vendier, Laure; Sabo-Etienne, Sylviane; Montiel-Palma, Virginia |
Journal of publication | Dalton transactions (Cambridge, England : 2003) |
Year of publication | 2019 |
Journal volume | 48 |
Journal issue | 37 |
Pages of publication | 14010 - 14018 |
a | 46.882 ± 0.014 Å |
b | 10.431 ± 0.003 Å |
c | 22.858 ± 0.007 Å |
α | 90° |
β | 117.182 ± 0.006° |
γ | 90° |
Cell volume | 9944 ± 5 Å3 |
Cell temperature | 100 K |
Ambient diffraction temperature | 100 K |
Number of distinct elements | 6 |
Space group number | 15 |
Hermann-Mauguin space group symbol | C 1 2/c 1 |
Hall space group symbol | -C 2yc |
Residual factor for all reflections | 0.0589 |
Residual factor for significantly intense reflections | 0.0492 |
Weighted residual factors for all reflections | 0.0527 |
Weighted residual factors for significantly intense reflections | 0.0472 |
Weighted residual factors for all reflections included in the refinement | 0.0463 |
Goodness-of-fit parameter for all reflections included in the refinement | 1.0156 |
Diffraction radiation wavelength | 0.71073 Å |
Diffraction radiation type | MoKα |