Information card for entry 7701039
Formula | C21 H12 Br2 Cu2 F12 N4 |
Calculated formula | C21 H12 Br2 Cu2 F12 N4 |
Title of publication | Acetylene and terminal alkyne complexes of copper(i) supported by fluorinated pyrazolates: syntheses, structures, and transformations. |
Authors of publication | Parasar, Devaborniny; Ponduru, Tharun T.; Noonikara-Poyil, Anurag; Jayaratna, Naleen B.; Dias, H. V. Rasika |
Journal of publication | Dalton transactions (Cambridge, England : 2003) |
Year of publication | 2019 |
Journal volume | 48 |
Journal issue | 42 |
Pages of publication | 15782 - 15794 |
a | 17.0895 ± 0.0006 Å |
b | 15.2842 ± 0.0005 Å |
c | 10.1011 ± 0.0003 Å |
α | 90° |
β | 90° |
γ | 90° |
Cell volume | 2638.4 ± 0.15 Å3 |
Cell temperature | 100 ± 2 K |
Ambient diffraction temperature | 100.01 K |
Number of distinct elements | 6 |
Space group number | 36 |
Hermann-Mauguin space group symbol | C m c 21 |
Hall space group symbol | C 2c -2 |
Residual factor for all reflections | 0.0239 |
Residual factor for significantly intense reflections | 0.0218 |
Weighted residual factors for significantly intense reflections | 0.0501 |
Weighted residual factors for all reflections included in the refinement | 0.0511 |
Goodness-of-fit parameter for all reflections included in the refinement | 1.073 |
Diffraction radiation wavelength | 0.71073 Å |
Diffraction radiation type | MoKα |