Information card for entry 7701040
Formula | C19 H14 Cu2 F12 N4 |
Calculated formula | C19 H14 Cu2 F12 N4 |
Title of publication | Acetylene and terminal alkyne complexes of copper(i) supported by fluorinated pyrazolates: syntheses, structures, and transformations. |
Authors of publication | Parasar, Devaborniny; Ponduru, Tharun T.; Noonikara-Poyil, Anurag; Jayaratna, Naleen B.; Dias, H. V. Rasika |
Journal of publication | Dalton transactions (Cambridge, England : 2003) |
Year of publication | 2019 |
Journal volume | 48 |
Journal issue | 42 |
Pages of publication | 15782 - 15794 |
a | 11.085 ± 0.0004 Å |
b | 14.3949 ± 0.0005 Å |
c | 14.0223 ± 0.0004 Å |
α | 90° |
β | 90.746 ± 0.001° |
γ | 90° |
Cell volume | 2237.31 ± 0.13 Å3 |
Cell temperature | 100 ± 2 K |
Ambient diffraction temperature | 100 K |
Number of distinct elements | 5 |
Space group number | 14 |
Hermann-Mauguin space group symbol | P 1 21/n 1 |
Hall space group symbol | -P 2yn |
Residual factor for all reflections | 0.0352 |
Residual factor for significantly intense reflections | 0.0279 |
Weighted residual factors for significantly intense reflections | 0.0704 |
Weighted residual factors for all reflections included in the refinement | 0.074 |
Goodness-of-fit parameter for all reflections included in the refinement | 1.06 |
Diffraction radiation wavelength | 0.71073 Å |
Diffraction radiation type | MoKα |