Information card for entry 7701041
Formula | C26 H14 Cu2 F12 N4 |
Calculated formula | C26 H14 Cu2 F12 N4 |
Title of publication | Acetylene and terminal alkyne complexes of copper(i) supported by fluorinated pyrazolates: syntheses, structures, and transformations. |
Authors of publication | Parasar, Devaborniny; Ponduru, Tharun T.; Noonikara-Poyil, Anurag; Jayaratna, Naleen B.; Dias, H. V. Rasika |
Journal of publication | Dalton transactions (Cambridge, England : 2003) |
Year of publication | 2019 |
Journal volume | 48 |
Journal issue | 42 |
Pages of publication | 15782 - 15794 |
a | 12.9771 ± 0.0015 Å |
b | 13.636 ± 0.0015 Å |
c | 17.588 ± 0.003 Å |
α | 71.399 ± 0.003° |
β | 71.758 ± 0.002° |
γ | 79.715 ± 0.002° |
Cell volume | 2790.7 ± 0.7 Å3 |
Cell temperature | 175 ± 2 K |
Ambient diffraction temperature | 175 K |
Number of distinct elements | 5 |
Space group number | 2 |
Hermann-Mauguin space group symbol | P -1 |
Hall space group symbol | -P 1 |
Residual factor for all reflections | 0.0601 |
Residual factor for significantly intense reflections | 0.0465 |
Weighted residual factors for significantly intense reflections | 0.1289 |
Weighted residual factors for all reflections included in the refinement | 0.1401 |
Goodness-of-fit parameter for all reflections included in the refinement | 1.045 |
Diffraction radiation wavelength | 0.71073 Å |
Diffraction radiation type | MoKα |