Information card for entry 7701043
Formula | C66 H70 Dy4 N18 O26 |
Calculated formula | C66 H70 Dy4 N18 O26 |
Title of publication | Slow magnetic relaxation in Dy<sub>2</sub> and Dy<sub>4</sub> complexes of a versatile, trifunctional polydentate N,O-ligand. |
Authors of publication | Anwar, Muhammad U.; Al-Harrasi, Ahmed; Rawson, Jeremy M.; Gavey, Emma L.; Regier, Jeffery; Alexandropoulos, Dimitrios; Pilkington, Melanie; Thompson, Laurence K. |
Journal of publication | Dalton transactions (Cambridge, England : 2003) |
Year of publication | 2019 |
Journal volume | 48 |
Journal issue | 38 |
Pages of publication | 14269 - 14278 |
a | 14.7253 ± 0.001 Å |
b | 18.0284 ± 0.0011 Å |
c | 14.9893 ± 0.001 Å |
α | 90° |
β | 91.787 ± 0.002° |
γ | 90° |
Cell volume | 3977.3 ± 0.4 Å3 |
Cell temperature | 173 ± 2 K |
Ambient diffraction temperature | 173 ± 2 K |
Number of distinct elements | 5 |
Space group number | 14 |
Hermann-Mauguin space group symbol | P 1 21/n 1 |
Hall space group symbol | -P 2yn |
Residual factor for all reflections | 0.0674 |
Residual factor for significantly intense reflections | 0.0503 |
Weighted residual factors for significantly intense reflections | 0.1205 |
Weighted residual factors for all reflections included in the refinement | 0.1329 |
Goodness-of-fit parameter for all reflections included in the refinement | 1.02 |
Diffraction radiation wavelength | 1.54178 Å |
Diffraction radiation type | CuKα |