Information card for entry 7701044
Formula | C68 H74 Gd4 N18 O26 |
Calculated formula | C68 H74 Gd4 N18 O26 |
Title of publication | Slow magnetic relaxation in Dy<sub>2</sub> and Dy<sub>4</sub> complexes of a versatile, trifunctional polydentate N,O-ligand. |
Authors of publication | Anwar, Muhammad U.; Al-Harrasi, Ahmed; Rawson, Jeremy M.; Gavey, Emma L.; Regier, Jeffery; Alexandropoulos, Dimitrios; Pilkington, Melanie; Thompson, Laurence K. |
Journal of publication | Dalton transactions (Cambridge, England : 2003) |
Year of publication | 2019 |
Journal volume | 48 |
Journal issue | 38 |
Pages of publication | 14269 - 14278 |
a | 11.3795 ± 0.0006 Å |
b | 12.14 ± 0.0006 Å |
c | 14.4181 ± 0.0007 Å |
α | 85.283 ± 0.002° |
β | 75.253 ± 0.002° |
γ | 74.747 ± 0.002° |
Cell volume | 1858.1 ± 0.16 Å3 |
Cell temperature | 173 ± 2 K |
Ambient diffraction temperature | 173 ± 2 K |
Number of distinct elements | 5 |
Space group number | 2 |
Hermann-Mauguin space group symbol | P -1 |
Hall space group symbol | -P 1 |
Residual factor for all reflections | 0.0676 |
Residual factor for significantly intense reflections | 0.0427 |
Weighted residual factors for significantly intense reflections | 0.09 |
Weighted residual factors for all reflections included in the refinement | 0.1124 |
Goodness-of-fit parameter for all reflections included in the refinement | 1.11 |
Diffraction radiation wavelength | 0.71073 Å |
Diffraction radiation type | MoKα |