Information card for entry 7701047
Formula | Ge O S2 Sr |
Calculated formula | Ge O S2 Sr |
Title of publication | Synthesis, crystal structures and optical properties of noncentrosymmetric oxysulfides AeGeS<sub>2</sub>O (Ae = Sr, Ba). |
Authors of publication | Zhang, Xian; Xiao, Yi; Wang, Ruiqi; Fu, Pengxiang; Zheng, Chong; Huang, Fuqiang |
Journal of publication | Dalton transactions (Cambridge, England : 2003) |
Year of publication | 2019 |
Journal volume | 48 |
Journal issue | 39 |
Pages of publication | 14662 - 14668 |
a | 4.6627 ± 0.0004 Å |
b | 8.0622 ± 0.0007 Å |
c | 12.0975 ± 0.0013 Å |
α | 90° |
β | 90° |
γ | 90° |
Cell volume | 454.76 ± 0.07 Å3 |
Cell temperature | 293 ± 2 K |
Ambient diffraction temperature | 293 ± 2 K |
Number of distinct elements | 4 |
Space group number | 19 |
Hermann-Mauguin space group symbol | P 21 21 21 |
Hall space group symbol | P 2ac 2ab |
Residual factor for all reflections | 0.0345 |
Residual factor for significantly intense reflections | 0.0287 |
Weighted residual factors for significantly intense reflections | 0.0556 |
Weighted residual factors for all reflections included in the refinement | 0.0581 |
Goodness-of-fit parameter for all reflections included in the refinement | 0.995 |
Diffraction radiation wavelength | 0.71073 Å |
Diffraction radiation type | MoKα |