Information card for entry 7701048
Formula | C10 H19 F6 N4 O5 P |
Calculated formula | C10 H19 F6 N4 O5 P |
Title of publication | Dinuclear zwitterionic silver(i) and gold(i) complexes bearing 2,2-acetate-bridged bisimidazolylidene ligands. |
Authors of publication | Dominelli, Bruno; Roberts, Gerri M.; Jandl, Christian; Fischer, Pauline J.; Reich, Robert M.; Pöthig, Alexander; Correia, João D G; Kühn, Fritz E |
Journal of publication | Dalton transactions (Cambridge, England : 2003) |
Year of publication | 2019 |
Journal volume | 48 |
Journal issue | 37 |
Pages of publication | 14036 - 14043 |
a | 11.4241 ± 0.0003 Å |
b | 6.2939 ± 0.0002 Å |
c | 23.5348 ± 0.0007 Å |
α | 90° |
β | 94.12 ± 0.002° |
γ | 90° |
Cell volume | 1687.83 ± 0.09 Å3 |
Cell temperature | 123 K |
Ambient diffraction temperature | 123 K |
Number of distinct elements | 6 |
Space group number | 14 |
Hermann-Mauguin space group symbol | P 1 21/n 1 |
Hall space group symbol | -P 2yn |
Residual factor for all reflections | 0.047 |
Residual factor for significantly intense reflections | 0.033 |
Weighted residual factors for significantly intense reflections | 0.0682 |
Weighted residual factors for all reflections included in the refinement | 0.0737 |
Goodness-of-fit parameter for all reflections included in the refinement | 1.039 |
Diffraction radiation probe | x-ray |
Diffraction radiation wavelength | 0.71073 Å |
Diffraction radiation type | MoKα |