Information card for entry 7701049
Formula | C32 H50 Ag2 N8 O6 |
Calculated formula | C32 H50 Ag2 N8 O6 |
Title of publication | Dinuclear zwitterionic silver(i) and gold(i) complexes bearing 2,2-acetate-bridged bisimidazolylidene ligands. |
Authors of publication | Dominelli, Bruno; Roberts, Gerri M.; Jandl, Christian; Fischer, Pauline J.; Reich, Robert M.; Pöthig, Alexander; Correia, João D G; Kühn, Fritz E |
Journal of publication | Dalton transactions (Cambridge, England : 2003) |
Year of publication | 2019 |
Journal volume | 48 |
Journal issue | 37 |
Pages of publication | 14036 - 14043 |
a | 8.2043 ± 0.0006 Å |
b | 11.6334 ± 0.0007 Å |
c | 12.2004 ± 0.0008 Å |
α | 100.631 ± 0.003° |
β | 90.414 ± 0.003° |
γ | 91.17 ± 0.003° |
Cell volume | 1144.16 ± 0.13 Å3 |
Cell temperature | 100 K |
Ambient diffraction temperature | 100 K |
Number of distinct elements | 5 |
Space group number | 2 |
Hermann-Mauguin space group symbol | P -1 |
Hall space group symbol | -P 1 |
Residual factor for all reflections | 0.0293 |
Residual factor for significantly intense reflections | 0.0247 |
Weighted residual factors for significantly intense reflections | 0.0559 |
Weighted residual factors for all reflections included in the refinement | 0.0573 |
Goodness-of-fit parameter for all reflections included in the refinement | 1.042 |
Diffraction radiation probe | x-ray |
Diffraction radiation wavelength | 0.71073 Å |
Diffraction radiation type | MoKα |