Information card for entry 7701074
Formula | C20 H17 I2 N3 Pt S3 |
Calculated formula | C20 H17 I2 N3 Pt S3 |
Title of publication | Synthesis and electropolymerization of N-heterocyclic carbene complexes of Pd(ii) and Pt(ii) from an emissive imidazolium salt with a terthiophene backbone. |
Authors of publication | Wang, Weiran; Guo, Hongyu; Jones, Richard A. |
Journal of publication | Dalton transactions (Cambridge, England : 2003) |
Year of publication | 2019 |
Journal volume | 48 |
Journal issue | 38 |
Pages of publication | 14440 - 14449 |
a | 21.932 ± 0.003 Å |
b | 11.3524 ± 0.0013 Å |
c | 19.528 ± 0.002 Å |
α | 90° |
β | 99.221 ± 0.006° |
γ | 90° |
Cell volume | 4799.3 ± 1 Å3 |
Cell temperature | 100 K |
Ambient diffraction temperature | 100 K |
Number of distinct elements | 6 |
Space group number | 14 |
Hermann-Mauguin space group symbol | P 1 21/c 1 |
Hall space group symbol | -P 2ybc |
Residual factor for all reflections | 0.0344 |
Residual factor for significantly intense reflections | 0.027 |
Weighted residual factors for significantly intense reflections | 0.059 |
Weighted residual factors for all reflections included in the refinement | 0.0612 |
Goodness-of-fit parameter for all reflections included in the refinement | 1.057 |
Diffraction radiation wavelength | 0.71073 Å |
Diffraction radiation type | MoKα |