Information card for entry 7701075
Formula | C13 H15 Cl2 I2 N3 Pd S |
Calculated formula | C13 H15 Cl2 I2 N3 Pd S |
Title of publication | Synthesis and electropolymerization of N-heterocyclic carbene complexes of Pd(ii) and Pt(ii) from an emissive imidazolium salt with a terthiophene backbone. |
Authors of publication | Wang, Weiran; Guo, Hongyu; Jones, Richard A. |
Journal of publication | Dalton transactions (Cambridge, England : 2003) |
Year of publication | 2019 |
Journal volume | 48 |
Journal issue | 38 |
Pages of publication | 14440 - 14449 |
a | 16.423 ± 0.002 Å |
b | 7.9595 ± 0.001 Å |
c | 15.932 ± 0.002 Å |
α | 90° |
β | 108.871 ± 0.005° |
γ | 90° |
Cell volume | 1970.7 ± 0.4 Å3 |
Cell temperature | 100 K |
Ambient diffraction temperature | 100.15 K |
Number of distinct elements | 7 |
Space group number | 14 |
Hermann-Mauguin space group symbol | P 1 21/c 1 |
Hall space group symbol | -P 2ybc |
Residual factor for all reflections | 0.0193 |
Residual factor for significantly intense reflections | 0.0168 |
Weighted residual factors for significantly intense reflections | 0.0406 |
Weighted residual factors for all reflections included in the refinement | 0.0412 |
Goodness-of-fit parameter for all reflections included in the refinement | 1.075 |
Diffraction radiation wavelength | 0.71073 Å |
Diffraction radiation type | MoKα |