Information card for entry 7701079
Formula | C44 H52 Cu2 N6 O22 Tb2 |
Calculated formula | C44 H52 Cu2 N6 O22 Tb2 |
Title of publication | The role of 3d-4f exchange interaction in SMM behaviour and magnetic refrigeration of carbonato bridged CuLn (Ln = Dy, Tb and Gd) complexes of an unsymmetrical N<sub>2</sub>O<sub>4</sub> donor ligand. |
Authors of publication | Maity, Souvik; Mondal, Arpan; Konar, Sanjit; Ghosh, Ashutosh |
Journal of publication | Dalton transactions (Cambridge, England : 2003) |
Year of publication | 2019 |
Journal volume | 48 |
Journal issue | 40 |
Pages of publication | 15170 - 15183 |
a | 14.1685 ± 0.0014 Å |
b | 12.4034 ± 0.0013 Å |
c | 14.3048 ± 0.0015 Å |
α | 90° |
β | 92.458 ± 0.002° |
γ | 90° |
Cell volume | 2511.6 ± 0.4 Å3 |
Cell temperature | 296 ± 2 K |
Ambient diffraction temperature | 296 K |
Number of distinct elements | 6 |
Space group number | 14 |
Hermann-Mauguin space group symbol | P 1 21/n 1 |
Hall space group symbol | -P 2yn |
Residual factor for all reflections | 0.0794 |
Residual factor for significantly intense reflections | 0.0524 |
Weighted residual factors for significantly intense reflections | 0.138 |
Weighted residual factors for all reflections included in the refinement | 0.1647 |
Goodness-of-fit parameter for all reflections included in the refinement | 1.086 |
Diffraction radiation wavelength | 0.71073 Å |
Diffraction radiation type | MoKα |