Information card for entry 7701098
Formula | C88 H56.69 Au B2 Cl4 F30 N4 |
Calculated formula | C88 H56.684 Au B2 Cl4 F30 N4 |
Title of publication | Imidazolyl-phenyl (IMP) anions: a modular structure for tuning solubility and coordinating ability. |
Authors of publication | Wozniak, Derek I.; Hicks, Andrew J.; Sabbers, William A.; Dobereiner, Graham E. |
Journal of publication | Dalton transactions (Cambridge, England : 2003) |
Year of publication | 2019 |
Journal volume | 48 |
Journal issue | 37 |
Pages of publication | 14138 - 14155 |
a | 13.708 ± 0.002 Å |
b | 18.136 ± 0.003 Å |
c | 18.494 ± 0.003 Å |
α | 113.739 ± 0.003° |
β | 97.758 ± 0.003° |
γ | 99.532 ± 0.003° |
Cell volume | 4045.8 ± 1.1 Å3 |
Cell temperature | 100 ± 2 K |
Ambient diffraction temperature | 100.11 K |
Number of distinct elements | 7 |
Space group number | 2 |
Hermann-Mauguin space group symbol | P -1 |
Hall space group symbol | -P 1 |
Residual factor for all reflections | 0.0557 |
Residual factor for significantly intense reflections | 0.0442 |
Weighted residual factors for significantly intense reflections | 0.1206 |
Weighted residual factors for all reflections included in the refinement | 0.1276 |
Goodness-of-fit parameter for all reflections included in the refinement | 1.042 |
Diffraction radiation wavelength | 0.71073 Å |
Diffraction radiation type | MoKα |